Exception: Child returned 134

#1

Had a large job crash on me. It didn’t run out of RAM - I’m a bit puzzled at why it stopped.

000 rw-p 0017c000 fc:00 655281                     /usr/lib/x86_64-linux-gnu/libstdc++.so.6.0.21
7fd46f51c000-7fd46f520000 rw-p 00000000 00:00 0
7fd46f520000-7fd46f577000 r-xp 00000000 fc:00 676027                     /usr/lib/x86_64-linux-gnu/libjpeg.so.8.0.2
7fd46f577000-7fd46f777000 ---p 00057000 fc:00 676027                     /usr/lib/x86_64-linux-gnu/libjpeg.so.8.0.2
7fd46f777000-7fd46f778000 r--p 00057000 fc:00 676027                     /usr/lib/x86_64-linux-gnu/libjpeg.so.8.0.2
7fd46f778000-7fd46f779000 rw-p 00058000 fc:00 676027                     /usr/lib/x86_64-linux-gnu/libjpeg.so.8.0.2
7fd46f779000-7fd46f7ea000 r-xp 00000000 fc:00 678901                     /usr/lib/x86_64-linux-gnu/libtiff.so.5.2.4
7fd46f7ea000-7fd46f9ea000 ---p 00071000 fc:00 678901                     /usr/lib/x86_64-linux-gnu/libtiff.so.5.2.4
7fd46f9ea000-7fd46f9eb000 r--p 00071000 fc:00 678901                     /usr/lib/x86_64-linux-gnu/libtiff.so.5.2.4
7fd46f9eb000-7fd46f9ee000 rw-p 00072000 fc:00 678901                     /usr/lib/x86_64-linux-gnu/libtiff.so.5.2.4
7fd46f9ee000-7fd46fa12000 r-xp 00000000 fc:00 783944                     /lib/x86_64-linux-gnu/libpng12.so.0.54.0
7fd46fa12000-7fd46fc11000 ---p 00024000 fc:00 783944                     /lib/x86_64-linux-gnu/libpng12.so.0.54.0
7fd46fc11000-7fd46fc12000 r--p 00023000 fc:00 783944                     /lib/x86_64-linux-gnu/libpng12.so.0.54.0
7fd46fc12000-7fd46fc13000 rw-p 00024000 fc:00 783944                     /lib/x86_64-linux-gnu/libpng12.so.0.54.0
7fd46fc13000-7fd46fc39000 r-xp 00000000 fc:00 783838                     /lib/x86_64-linux-gnu/ld-2.23.so
7fd46fe00000-7fd46fe0a000 rw-p 00000000 00:00 0
7fd46fe37000-7fd46fe38000 rw-p 00000000 00:00 0
7fd46fe38000-7fd46fe39000 r--p 00025000 fc:00 783838                     /lib/x86_64-linux-gnu/ld-2.23.so
7fd46fe39000-7fd46fe3a000 rw-p 00026000 fc:00 783838                     /lib/x86_64-linux-gnu/ld-2.23.so
7fd46fe3a000-7fd46fe3b000 rw-p 00000000 00:00 0
7fff15da3000-7fff15dc4000 rw-p 00000000 00:00 0                          [stack]
7fff15df2000-7fff15df5000 r--p 00000000 00:00 0                          [vvar]
7fff15df5000-7fff15df7000 r-xp 00000000 00:00 0                          [vdso]
ffffffffff600000-ffffffffff601000 r-xp 00000000 00:00 0                  [vsyscall]
Aborted (core dumped)
Traceback (most recent call last):
File "/code/run.py", line 47, in <module>
plasm.execute(niter=1)
File "/code/scripts/mve.py", line 126, in process
system.run('%s %s %s' % (context.dmrecon_path, ' '.join(dmrecon_config), tree.mve), env_vars={'OMP_NUM_THREADS': args.max_concurrency})
File "/code/opendm/system.py", line 36, in run
raise Exception("Child returned {}".format(retcode))
Exception: Child returned 134